�s���{���R�[�h���͎s�撬���R�[�h,NO,�s���{����,�s�撬����,����,����_�J�i,����_�ʏ�,POI�R�[�h,�Z��,����,�ܓx,�o�x,�d�b�ԍ�,�����ԍ�,�@�l�ԍ�,�c�̖�,���p�\�j��,�J�n����,�I������,���p�\���ԓ��L����,����,�o���A�t���[���,URL,���l
43419,1,�{�錧,�ېX��,���꒡��,���N�o�`���E�V��,,,�ېX��������120�Ԓn,,37.91142685,140.7654206,0224-72-2111,,,,,,,,,,https://www.town.marumori.miyagi.jp/,
43419,2,�{�錧,�ېX��,���ԌɌ��q��,�_�C�C�`�V���R�P���\�E�R,,,�ېX��������120�Ԓn,,37.91185466,140.7653951,,,,,,,,,,,,
43419,3,�{�錧,�ېX��,���Ԍ�,�_�C�j�V���R,,,�ېX��������120�Ԓn,,37.91185214,140.7661287,,,,,,,,,,,,
43419,4,�{�錧,�ېX��,�ېX�܂��Â���Z���^�[,�}�������}�`�d�N���Z���^�[,,,�ېX��������120�Ԓn,,37.91150738,140.7661191,0224-72-1683,,,,,,,,,,https://www.town.marumori.miyagi.jp/machisen/maru-machi/,
43419,5,�{�錧,�ېX��,���R�܂��Â���Z���^�[,�J�l���}�}�`�d�N���Z���^�[,,,�ېX�����R�����O�쌴17�Ԓn,,37.90159096,140.7985323,0224-78-1121,,,,,,,,,,https://www.town.marumori.miyagi.jp/machisen/kane-machi/,
43419,6,�{�錧,�ېX��,�M��܂��Â���Z���^�[,�q�b�|�}�`�d�N���Z���^�[,,,�ېX���M�᎚�a�c80�Ԓn2,,37.82740059,140.7289978,0224-76-2111,,,,,,,,,,https://www.town.marumori.miyagi.jp/machisen/hippo-machi/,
43419,7,�{�錧,�ېX��,����܂��Â���Z���^�[,�I�I�E�`�}�`�d�N���Z���^�[,,,�ېX�����������82�Ԓn1,,37.86871369,140.8261436,0224-79-2004,,,,,,,,,,https://www.town.marumori.miyagi.jp/machisen/ouchi-machi/,
43419,8,�{�錧,�ېX��,���ւ܂��Â���Z���^�[,�R�T�C�}�`�d�N���Z���^�[,,,�ېX�����֎��R��63�Ԓn1,,37.919386,140.8214391,0224-78-1111,,,,,,,,,,https://www.town.marumori.miyagi.jp/machisen/kosai-machi/,
43419,9,�{�錧,�ېX��,�ږ�Ԃ܂��Â���Z���^�[,�^�e���}�}�`�d�N���Z���^�[,,,�ېX���ږ�ԊڎR�����148�Ԓn1,,37.92485694,140.7672591,0224-72-2120,,,,,,,,,,https://www.town.marumori.miyagi.jp/machisen/tate-machi/,
43419,10,�{�錧,�ېX��,�咣�܂��Â���Z���^�[,�I�I�n���}�`�d�N���Z���^�[,,,�ېX���咣�呠����O39�Ԓn1,,37.93706156,140.6764134,0224-75-2124,,,,,,,,,,https://www.town.marumori.miyagi.jp/machisen/oohari-machi/,
43419,11,�{�錧,�ېX��,�k��܂��Â���Z���^�[,�R�E���}�`�d�N���Z���^�[,,,�ېX���k�쎚������7�Ԓn4,,37.91677964,140.6457823,0224-75-2134,,,,,,,,,,https://www.town.marumori.miyagi.jp/machisen/kouya-machi/,
43419,12,�{�錧,�ېX��,�h�ЃZ���^�[,�{�E�T�C�Z���^�[,,,�ېX�������k20�Ԓn,,37.91434839,140.7668153,,,,,,,,,,,,
43419,13,�{�錧,�ېX��,�ېX���w�Z,�}�������V���E�K�b�R�E,,,�ېX�����H���39�Ԓn1,,37.91489078,140.7604879,0224-72-2140,,,,,,,,,,https://www.town.marumori.miyagi.jp/school/maru-sho/,
43419,14,�{�錧,�ېX��,�ږ�ԏ��w�Z,�^�e���}�V���E�K�b�R�E,,,�ېX���ږ�ԊڎR���ʐ�29�Ԓn1,,37.92424532,140.7723422,0224-72-2148,,,,,,,,,,https://www.town.marumori.miyagi.jp/school/tate-sho/,
43419,15,�{�錧,�ېX��,�ېX���w�Z,�}�������`���E�K�b�R�E,,,�ېX�����c����24�Ԓn2,,37.91737436,140.7645819,0224-72-2145,,,,,,,,,,https://www.town.marumori.miyagi.jp/school/marumori-jh/,
43419,16,�{�錧,�ېX��,�w�Z���H�Z���^�[,�K�b�R�E�L���E�V���N�Z���^�[,,,�ېX��������66�Ԓn,,37.91254624,140.7697969,0224-72-2804,,,,,,,,,,https://www.town.marumori.miyagi.jp/kyusyoku/,
43419,17,�{�錧,�ېX��,�����꒡��,�L���E���N�o�`���E�V��,,,�ېX�������k20�Ԓn,,37.9146476,140.7668637,,,,,,,,,,,,
43419,18,�{�錧,�ېX��,�a�c�R�~���j�e�B�Z���^�[,���_�R�~���j�e�B�Z���^�[,,,�ېX�����a�c��8�Ԓn93,,37.889943,140.7704014,,,,,,,,,,,,
43419,19,�{�錧,�ېX��,�����R�~���j�e�B�Z���^�[,�J�P�C���R�~���j�e�B�Z���^�[,,,�ېX����������20�Ԓn2,,37.88486944,140.7119882,,,,,,,,,,,,
43419,20,�{�錧,�ېX��,�t�R�~���j�e�B�Z���^�[,�A�I�o�R�~���j�e�B�Z���^�[,,,�ېX��������t��16�Ԓn2,,37.83372867,140.8342448,,,,,,,,,,,,
43419,21,�{�錧,�ېX��,�Ɏ�R�~���j�e�B�Z���^�[,�C�f�R�~���j�e�B�Z���^�[,,,�ېX����������~�P��27�Ԓn3,,37.89684144,140.8264156,,,,,,,,,,,,
43419,22,�{�錧,�ېX��,����Ґ��Y�����Z���^�[,�R�E���C�V���Z�C�T���J�c�h�E�Z���^�[,,,�ېX��������79�Ԓn1,,37.91216176,140.7638713,0224-72-1960,,,,,,,,,,,
43419,23,�{�錧,�ېX��,���c���q��,�`���E�G�C�z�E�{�N�W���E,,,�ېX���M�᎚���R�n��,,37.80917492,140.7735208,0224-76-2052,,,,,,,,,,,
43419,24,�{�錧,�ېX��,����������Z���^�[,�I�I�E�`�J�b�Z�C�J�Z���^�[,,,�ېX�����������7�Ԓn,,37.87380553,140.8230673,0224-79-3151,,,,,,,,,,http://ikiiki-ouchi.com/,
43419,25,�{�錧,�ېX��,���͔�Z���^�[,�g�E�Q�^�C�q�Z���^�[,,,�ېX����������21�Ԓn2,,37.87611565,140.7175789,,,,,,,,,,,,
43419,26,�{�錧,�ېX��,�M��͔�Z���^�[,�q�b�|�^�C�q�Z���^�[,,,�ېX���M�᎚���R3�Ԓn2,,37.81412982,140.7395247,,,,,,,,,,,,
43419,27,�{�錧,�ېX��,�M��n�擌�R�͔슣���{��,�q�b�|�`�N�q�K�V���}�^�C�q�J���\�E�V�Z�c,,,�ېX���M�᎚���R54�Ԓn118,,37.82116649,140.7546548,,,,,,,,,,,,
43419,28,�{�錧,�ېX��,�M��n�撆���͔슣���{��,�q�b�|�`�N�i�J�W�}�^�C�q�J���\�E�V�Z�c,,,�ېX���M�᎚���邵�V31�Ԓn2�A61�Ԓn3,,37.8295559,140.7341077,,,,,,,,,,,,
43419,29,�{�錧,�ېX��,������͔�Z���^�[,�N���T�m�^�C�q�Z���^�[,,,�ېX�������������120�Ԓn1,,37.8443001,140.803797,,,,,,,,,,,,
43419,30,�{�錧,�ېX��,������n����͔슣���{��,�N���T�m�`�N�_�C�j�^�C�q�J���\�E�V�Z�c,,,�ېX�������������103�Ԓn551,,37.83434002,140.8136968,,,,,,,,,,,,
43419,31,�{�錧,�ېX��,������n���O�͔슣���{��,�N���T�m�`�N�_�C�T���^�C�q�J���\�E�V�Z�c,,,�ېX�����Αq135�Ԓn,,37.88412471,140.7730054,,,,,,,,,,,,
43419,32,�{�錧,�ېX��,�ږ�ԑ��͔�Z���^�[,�^�e���}�_�C�C�`�^�C�q�Z���^�[,,,�ېX���ږ�ԊڎR������7�Ԓn,,37.92153385,140.7950646,,,,,,,,,,,,
43419,33,�{�錧,�ېX��,�ږ�ԑ��͔�Z���^�[,�^�e���}�_�C�j�^�C�q�Z���^�[,,,�ېX���ږ�ԊڎR������17�Ԓn,,37.92242346,140.7960885,,,,,,,,,,,,
43419,34,�{�錧,�ېX��,�k��ӂ邳�ƌ𗬃Z���^�[,�R�E���t���T�g�R�E�����E�Z���^�[,,,�ېX���k�쎚��65�Ԓn2,,37.91446821,140.6671994,,,,,,,,,,,,
43419,35,�{�錧,�ېX��,�L�Q���b���e�������{��,���E�K�C�`���E�W���E�Q�����E�J�V�����V�Z�c,,,�ېX�����~����4�Ԓn1,,37.92357686,140.7533472,,,,,,,,,,,,
43419,36,�{�錧,�ېX��,�q���琬�Z���^�[,�R�E�V�C�N�Z�C�Z���^�[,,,�ېX���M�᎚���R�n��,,37.8055836,140.7741361,,,,,,,,,,,,
43419,37,�{�錧,�ېX��,�ېX�ӂ邳�Ɗ�,�}�������t���T�g�J��,,,�ېX��������83�Ԓn1,,37.91236402,140.7646575,0224-72-2631,,,,,,,,,,https://www.town.marumori.miyagi.jp/education/detail.php?content=54,
43419,38,�{�錧,�ېX��,���R�}����,�J�l���}�g�V���J��,,,�ېX�����R�����O�쌴17�Ԓn,,37.90136541,140.7985803,0224-78-1121,,,,,,,,,,https://www.town.marumori.miyagi.jp/education/detail.php?content=423,
43419,39,�{�錧,�ېX��,���R�Z��,�J�l���}�W���E�^�N,,,�ېX�����R�������n��,,37.90376532,140.7966209,,,,,,,,,,,,
43419,40,�{�錧,�ېX��,�R�[�|������,�R�[�|�A�T�q�K�I�J,,,�ېX��������48�Ԓn3,,37.9163407,140.762698,,,,,,,,,,,,
43419,41,�{�錧,�ېX��,����Z��,�}�c�U�L�W���E�^�N,,,�ېX������ڈ꒚�ڒn��,,37.92855996,140.7643319,,,,,,,,,,,,
43419,42,�{�錧,�ېX��,������Z��,�}�c�U�L�_�C�j�W���E�^�N,,,�ېX������ڈ꒚�ڒn��,,37.92801312,140.7646359,,,,,,,,,,,,
43419,43,�{�錧,�ېX��,���Z��,�_�C�����W���E�^�N,,,�ېX������ڈ꒚�ڒn��,,37.92793606,140.7626118,,,,,,,,,,,,
43419,44,�{�錧,�ېX��,�����Z��,�_�C�����_�C�j�W���E�^�N,,,�ېX������ڈ꒚�ڒn��,,37.92811395,140.7619487,,,,,,,,,,,,
43419,45,�{�錧,�ېX��,�R�[�|�S�X��,�R�[�|�h�h�C�V,,,�ېX�����c����n��,,37.9171018,140.7625831,,,,,,,,,,,,
43419,46,�{�錧,�ېX��,�T���R�[�|���X�ېX,�T���R�[�|���X�}������,,,�ېX������ڈ꒚��71�Ԓn1�A71�Ԓn2,,37.92921291,140.7630541,,,,,,,,,,,,
43419,47,�{�錧,�ېX��,�����Z��,�q�K�V�_�C�����W���E�^�N,,,�ېX������ړ񒚖ڒn��,,37.92703019,140.7661185,,,,,,,,,,,,
43419,48,�{�錧,�ېX��,�R�[�|���R,�R�[�|�J�l���},,,�ېX�����R�������n��,,37.90330482,140.7965754,,,,,,,,,,,,
43419,49,�{�錧,�ېX��,�T���p���X���,�T���p���X�I�I�_�e,,,�ېX������ڎO����74�Ԓn1,,37.924787,140.7644922,,,,,,,,,,,,
43419,50,�{�錧,�ېX��,�T���p���X�犠��,�T���p���X�Z���K���o,,,�ېX�����犠��61�Ԓn,,37.91306432,140.7701179,,,,,,,,,,,,
43419,51,�{�錧,�ېX��,�T���p���X�犠����,�T���p���X�Z���K���o�_�C�j,,,�ېX�����犠��27�Ԓn,,37.91402572,140.7674873,,,,,,,,,,,,
43419,52,�{�錧,�ېX��,�T���p���X��ڑ��,�T���p���X�I�I�_�e�_�C�j,,,�ېX������ړ񒚖�25�Ԓn,,37.92749292,140.7643276,,,,,,,,,,,,
43419,53,�{�錧,�ېX��,�G�~�O�����h,�G�~�O�����h,,,�ېX�����_����7�Ԓn4,,37.91421601,140.7716731,,,,,,,,,,,,
43419,54,�{�錧,�ېX��,�����̈��,�`���E�~���^�C�C�N�J��,,,�ېX�����ԓc20�Ԓn,,37.91080158,140.7669794,,,,,,,,,,,,
43419,55,�{�錧,�ېX��,�약�X�|�[�c�𗬃Z���^�[,�J���_�C���X�|�[�c�R�E�����E�Z���^�[,,,�ېX���M�᎚�약��15�Ԓn3,,37.79580873,140.7451676,,,,,,,,,,,,
43419,56,�{�錧,�ېX��,���Ԃ��ܑ�,�A�u�N�}�\�E,,,�ېX�����s��50�Ԓn5,,37.87264064,140.7832809,0224-72-2105,,,,,,,,,,https://abukumaso.com/,
43419,57,�{�錧,�ېX��,�ό��𗬃Z���^�[,�J���R�E�R�E�����E�Z���^�[,,,�ېX��������12�Ԓn,,37.92208923,140.7601636,0224-72-2350,,,,,,,,,,https://marumori.jp/spot/funakudari/,
43419,58,�{�錧,�ېX��,�s���������L�����v��,�t�h�E�\���R�E�G���L�����v�W���E,,,�ېX�����s��64�Ԓn1,,37.86927932,140.7815022,0224-72-2646,,,,,,,,,,https://www.fudousonpark.site/,
43419,59,�{�錧,�ېX��,�Y�Ɠ`����,�T���M���E�f���V���E�J��,,,�ېX������m��34�Ԓn13,,37.91341092,140.6855857,0224-75-2869,,,,,,,,,,https://www.marufore.com/,
43419,60,�{�錧,�ېX��,���̋��y�ف@�V�����~,�N���m�L���E�h�J���@�T�C�����V�L,,,�ېX��������25�Ԓn,,37.91351569,140.7621786,0224-72-6636,,,,,,,,,,https://sairiyashiki.com/,
43419,61,�{�錧,�ېX��,���O�z�[��,�I�N�K�C�z�[��,,,�ېX�����s��50�Ԓn5,,37.87317904,140.7828979,,,,,,,,,,,,
43419,62,�{�錧,�ېX��,���R�䂤�䂤�ف@�V����,�V�[�����E���E�J���@�e���X�C�V��,,,�ېX�����s��56�Ԓn1,,37.87114428,140.7838803,0224-72-4528,,,,,,,,,,https://abukumaso.com/banquet,
43419,63,�{�錧,�ېX��,�ό����Y�فi��܂��فj,�J���R�E�u�b�T���J���i���}�����J���j,,,�ېX��������83�Ԓn1,,37.91452291,140.7626882,0224-72-6663,,,,,,,,,,https://marumori.jp/,
43419,64,�{�錧,�ېX��,���S�s�X�n���������_�{��,�`���E�V���V�K�C�`�J�b�Z�C�J�L���e���V�Z�c,,,�ېX��������69�Ԓn,,37.91324508,140.7625871,0224-72-3188,,,,,,,,,,,
43419,65,�{�錧,�ېX��,�s�����N���C���K���e��,�t�h�E�\���N���C���K���e��,,,�ېX������ꐼ�n��,,37.87160363,140.7852606,0224-73-1150,,,,,,,,,,http://www02.jet.ne.jp/~fudonoen/index.html,
43419,66,�{�錧,�ېX��,�M��N���C���K���e��,�q�b�|�N���C���K���e��,,,�ېX���M�᎚�����n��,,37.84378023,140.7365129,0224-76-2230,,,,,,,,,,,
43419,67,�{�錧,�ېX��,�M�Ⴛ�Αł��̌���,�q�b�|�\�o�E�`�^�C�P���J��,,,�ېX���M�᎚����4�Ԓn27,,37.84596953,140.7426087,,,,,,,,,,,,
43419,68,�{�錧,�ېX��,����ۈ珊,�I�I�E�`�z�C�N�V��,,,�ېX�����������92�Ԓn7,,37.86383689,140.8283935,0224-79-3119,,,,,,,,,,https://marumori-shakyo.jp/ouchi/,
43419,69,�{�錧,�ېX��,�ی��Z���^�[,�z�P���Z���^�[,,,�ېX��������48�Ԓn,,37.91262489,140.7658467,0224-72-4051,,,,,,,,,,,
43419,70,�{�錧,�ېX��,�K��Ō�X�e�[�V����,�z�E�����J���S�X�e�[�V����,,,�ېX��������5�Ԓn1,,37.91363882,140.7649225,,,,,,,,,,,,
43419,71,�{�錧,�ېX��,�咣���N�Ǘ��Z���^�[,�I�I�n���P���R�E�J�����Z���^�[,,,�ېX���咣�쒣���{�c3�Ԓn,,37.93775561,140.6788388,,,,,,,,,,,,
43419,72,�{�錧,�ېX��,���M�ᒆ�w�Z�@�Z��,�L���E�q�b�|�`���E�K�b�R�E�@�R�E�V��,,,�ېX���M�᎚�a�c73�Ԓn,,37.8284171,140.728265,,,,,,,,,,,,
43419,73,�{�錧,�ېX��,��������w�Z�@�Z��,�L���E�I�I�E�`�`���E�K�b�R�E�@�R�E�V��,,,�ېX�����������19�Ԓn,,37.8719092,140.8264738,,,,,,,,,,,,
43419,74,�{�錧,�ېX��,�������N�ی��ېX�a�@,�R�N�~���P���R�E�z�P���}�������r���E�C��,,,�ېX��������27�Ԓn,,37.91241465,140.7663485,0224-72-2131,,,,,,,,,,https://www.town.marumori.miyagi.jp/maru-hospital/,
43419,75,�{�錧,�ېX��,�����G�^�������g�C��,�A�u�N�}�E���h�E�R�E�G���g�C��,,,�ېX���ږ�ԊڎR�����͌�,,37.91765697,140.7648932,,,,,,,,,,,,
43419,76,�{�錧,�ېX��,���Â݃g�C��,�T�N���d�c�~�g�C��,,,�ېX���ږ�ԊَR���������n��,,37.91356694,140.78295,,,,,,,,,,,,
43419,77,�{�錧,�ېX��,�����L��g�C��,�`���E�~���q���o�g�C��,,,�ېX�����ԓc20�Ԓn,,37.91086399,140.7664295,,,,,,,,,,,,
43419,78,�{�錧,�ېX��,�S�X�Ό����g�C��,�h�h�C�V�R�E�G���g�C��,,,�ېX�����c���k�n��,,37.9189158,140.7618191,,,,,,,,,,,,
43419,79,�{�錧,�ېX��,�s�����������ԏ�g�C��,�t�h�E�\���R�E�G���`���E�V���W���E�g�C��,,,�ېX������ꐼ�n��,,37.87088458,140.7844753,,,,,,,,,,,,
43419,80,�{�錧,�ېX��,�t�����Ð������W�]��,�A�I�o�n�^�}�L�R�Z���W���E�R�E�G���e���{�E�_�C,,,�ېX��������t��n��,,37.83223237,140.8528632,,,,,,,,,,,,
43419,81,�{�錧,�ېX��,�t�����Ð������g�C��,�A�I�o�n�^�}�L�R�Z���W���E�R�E�G���g�C��,,,�ېX��������t��n��,,37.83222436,140.8521571,,,,,,,,,,,,
43419,82,�{�錧,�ېX��,�ڎR�����g�C��,�^�e���}�R�E�G���g�C��,,,�ېX������ړ񒚖ڒn��,,37.92591643,140.7624274,,,,,,,,,,,,
43419,83,�{�錧,�ېX��,�ʐ�����g�C��,�^�}�K���R�E�G���g�C��,,,�ېX������ڎO���ڒn��,,37.92459133,140.7652122,,,,,,,,,,,,
43419,84,�{�錧,�ېX��,��������g�C��,�}�c�U�L�R�E�G���g�C��,,,�ېX������ڈ꒚�ڒn��,,37.92879339,140.7643668,,,,,,,,,,,,
43419,85,�{�錧,�ېX��,�ΉH�򐅏�,�C�V�p�W���E�X�C�W���E,,,�ېX�����ΉH�n��,,37.87801083,140.7781591,,,,,,,,,,,,
43419,86,�{�錧,�ېX��,�M��򐅏�,�q�b�|�W���E�X�C�W���E,,,�ېX���M�᎚����c�n��,,37.8261848,140.7018467,,,,,,,,,,,,
43419,87,�{�錧,�ېX��,������򐅏�,�N���T�m�W���E�X�C�W���E,,,�ېX��������약�n��,,37.85416393,140.815347,,,,,,,,,,,,
43419,88,�{�錧,�ېX��,���R�n��_�ƏW���r�������{��,�J�l���}�`�N�m�E�M���E�V���E���N�n�C�X�C�V�����V�Z�c,,,�ېX�����R�����O�쌴�n�� ,,37.89916309,140.7975943,,,,,,,,,,,,
43419,89,�{�錧,�ېX��,����n��_�ƏW���r�������{��,�I�I�E�`�`�N�m�E�M���E�V���E���N�n�C�X�C�V�����V�Z�c,,,�ېX�����������50�Ԓn�A51�Ԓn,,37.88246637,140.8208592,,,,,,,,,,,,
43419,90,�{�錧,�ېX��,���֒n��_�ƏW���r�������{��,�R�T�C�`�N�m�E�M���E�V���E���N�n�C�X�C�V�����V�Z�c,,,�ېX�����֎�����16�Ԓn1,,37.92068627,140.8191414,,,,,,,,,,,,
43419,91,�{�錧,�ېX��,������@�q��,�L���E���N�o�@�\�E�R,,,�ېX�������k20�Ԓn,,37.91464151,140.7666601,,,,,,,,,,,,
43419,92,�{�錧,�ېX��,��NTT�h��,�L���E�G�k�e�B�[�e�B�[�V���N�V��,,,�ېX�����c����n��,,37.9162108,140.7657296,,,,,,,,,,,,
43419,93,�{�錧,�ېX��,���ېX���w�Z�H�o�땪�Z,�L���E�}�������V���E�K�b�R�E�n�f�j���u���R�E,,,�ېX�����ΑŐ�3�Ԓn,,37.90259104,140.6769411,,,,,,,,,,,,
43419,94,�{�錧,�ېX��,���ېX�����w�Z�@�Ǘ���,�L���E�}�������q�K�V�`���E�K�b�R�E�@�J�����g�E,,,�ېX�����R������63�Ԓn1,,37.90394093,140.8049378,,,,,,,,,,,,
43419,95,�{�錧,�ېX��,���ېX�����w�Z�@�̈��,�L���E�}�������q�K�V�`���E�K�b�R�E�@�^�C�C�N�J��,,,�ېX�����R������63�Ԓn1,,37.90415973,140.8050825,,,,,,,,,,,,
43419,96,�{�錧,�ېX��,���M�ᒆ�w�Z�@�̈��,�L���E�q�b�|�`���E�K�b�R�E�@�^�C�C�N�J��,,,�ېX���M�᎚�a�c73�Ԓn,,37.82846935,140.7278695,,,,,,,,,,,,
43419,97,�{�錧,�ېX��,��������w�Z�@�̈��,�L���E�I�I�E�`�`���E�K�b�R�E�@�^�C�C�N�J��,,,�ېX�����������19�Ԓn,,37.87166588,140.8270259,,,,,,,,,,,,
43419,98,�{�錧,�ېX��,���ېX�����w�Z�@�̈��,�L���E�}�������j�V�`���E�K�b�R�E�@�^�C�C�N�J��,,,�ېX���k�쎚�H��30�Ԓn,,37.93535826,140.6654697,,,,,,,,,,,,
43419,99,�{�錧,�ېX��,�����R�ۈ珊,�L���E�J�l���}�z�C�N�V��,,,�ېX�����R�����O�쌴30�Ԓn,,37.90178067,140.7982158,,,,,,,,,,,,
43419,100,�{�錧,�ېX��,���M��ۈ珊,�L���E�q�b�|�z�C�N�V��,,,�ېX���M�᎚�ΐ_��4�Ԓn3,,37.82453246,140.7283987,,,,,,,,,,,,
43419,101,�{�錧,�ېX��,���a�c�ۈ珊,�L���E���_�z�C�N�V��,,,�ېX�����a�c��70�Ԓn1,,37.89002728,140.7709563,,,,,,,,,,,,
43419,102,�{�錧,�ېX��,���k�쎙����,�L���E�R�E���W�h�E�J��,,,�ېX���k�쎚������8�Ԓn,,37.91706732,140.6458592,,,,,,,,,,,,
43419,103,�{�錧,�ېX��,������s,�L���E�Z���_�C�M���R�E,,,�ېX��������29�Ԓn2,,37.91391099,140.7622217,,,,,,,,,,,,
43419,104,�{�錧,�ېX��,�����R���w�Z,�L���E�J�l���}�V���E�K�b�R�E,,,�ېX�����R�����O�쌴1�Ԓn1,,37.90109901,140.7984232,,,,,,,,,,,,
43419,105,�{�錧,�ېX��,���M�Ꮼ�w�Z,�L���E�q�b�|�V���E�K�b�R�E,,,�ېX���M�᎚����3�Ԓn2,,37.83591353,140.7321402,,,,,,,,,,,,
43419,106,�{�錧,�ېX��,��������w�Z,�L���E�I�I�E�`�V���E�K�b�R�E,,,�ېX�����������18�Ԓn,,37.87176539,140.8255963,,,,,,,,,,,,
43419,107,�{�錧,�ېX��,�����֏��w�Z,�L���E�R�T�C�V���E�K�b�R�E,,,�ېX�����֎��Ê�95�Ԓn,,37.91826714,140.8230809,,,,,,,,,,,,
43419,108,�{�錧,�ېX��,���咣���w�Z,�L���E�I�I�n���V���E�K�b�R�E,,,�ېX���咣�쒣���{�c25�Ԓn,,37.93669281,140.677066,,,,,,,,,,,,
43419,109,�{�錧,�ېX��,���k�쏬�w�Z,�L���E�R�E���V���E�K�b�R�E,,,�ېX���k�쎚����44�Ԓn1,,37.91965552,140.645557,,,,,,,,,,,,
43419,110,�{�錧,�ېX��,���咣������,�L���E�I�I�n���W�h�E�J��,,,�ېX���咣�呠����O22�Ԓn,,37.93755164,140.675562,,,,,,,,,,,,
